Target
Cannabinoid receptor 2
Ligand
BDBM50222837
Substrate
Meas. Tech.
ChEMBL_458048 (CHEMBL925386)
IC50
3.4±n/a nM
Citation
 Ohta, HIshizaka, TTatsuzuki, MYoshinaga, MIida, ITomishima, YToda, YSaito, S N-Alkylidenearylcarboxamides as new potent and selective CB(2) cannabinoid receptor agonists with good oral bioavailability. Bioorg Med Chem Lett 17:6299-304 (2007)  
Target
Name:
Cannabinoid receptor 2
Synonyms:
CANNABINOID CB2 CB2 CB2B CNR2_HUMAN Cannabinoid CB2 receptor Cannabinoid receptor 2 (CB2R) | hCB2
Type:
G Protein-Coupled Receptor (GPCR)
Mol. Mass.:
39690.94
Organism:
Homo sapiens (Human)
Description:
P34972
Residue:
360
  
Inhibitor
Name:
BDBM50222837
Synonyms:
CHEMBL248385 | N-(5-tert-butyl-3-(cyclopropylmethyl)-4-methylthiazol-2(3H)-ylidene)-2-fluoro-5-(trifluoromethyl)benzamide
Type:
Small organic molecule
Emp. Form.:
C20H22F4N2OS
Mol. Mass.:
414.46
SMILES:
Cc1c(s\c(=N/C(=O)c2cc(ccc2F)C(F)(F)F)n1CC1CC1)C(C)(C)C
: