Target
Serine/threonine-protein kinase Chk1
Ligand
BDBM50224905
Substrate
Meas. Tech.
ChEMBL_458388 (CHEMBL942709)
IC50
0.300000±n/a nM
Citation
 Tao, ZFChen, ZBui, MHKovar, PJohnson, EBouska, JZhang, HRosenberg, SSowin, TLin, NH Macrocyclic ureas as potent and selective Chk1 inhibitors: an improved synthesis, kinome profiling, structure-activity relationships, and preliminary pharmacokinetics. Bioorg Med Chem Lett 17:6593-601 (2007)  
Target
Name:
Serine/threonine-protein kinase Chk1
Synonyms:
CHEK1 CHK1 checkpoint homolog Checkpoint kinase-1 (CHK1)
Type:
Enzyme Catalytic Domain
Mol. Mass.:
54443.02
Organism:
Homo sapiens (Human)
Description:
gi_166295192
Residue:
476
  
Inhibitor
Name:
BDBM50224905
Synonyms:
(Z)-7-chloro-8-(3-morpholin-4-yl-propoxy)-3-oxo-11,16-dioxa-2,4,19,21-tetraaza-tricyclo[15.3.1.0*5,10*]henicosa-1(21),5,7,9,13,17,19-heptaene-18-carbonitrile | CHEMBL400397
Type:
Small organic molecule
Emp. Form.:
C23H25ClN6O5
Mol. Mass.:
500.935
SMILES:
Clc1cc2NC(=O)Nc3cnc(C#N)c(OC\C=C/COc2cc1OCCCN1CCOCC1)n3
: