Target
Serine/threonine-protein kinase Chk1
Ligand
BDBM50224893
Substrate
Meas. Tech.
ChEMBL_458388 (CHEMBL942709)
IC50
0.300000±n/a nM
Citation
 Tao, ZFChen, ZBui, MHKovar, PJohnson, EBouska, JZhang, HRosenberg, SSowin, TLin, NH Macrocyclic ureas as potent and selective Chk1 inhibitors: an improved synthesis, kinome profiling, structure-activity relationships, and preliminary pharmacokinetics. Bioorg Med Chem Lett 17:6593-601 (2007)  
Target
Name:
Serine/threonine-protein kinase Chk1
Synonyms:
CHEK1 CHK1 checkpoint homolog Checkpoint kinase-1 (CHK1)
Type:
Enzyme Catalytic Domain
Mol. Mass.:
54443.02
Organism:
Homo sapiens (Human)
Description:
gi_166295192
Residue:
476
  
Inhibitor
Name:
BDBM50224893
Synonyms:
7-chloro-8-hydroxy-3-oxo-11,16-dioxa-2,4,19,21-tetraaza-tricyclo[15.3.1.0*5,10*]henicosa-1(21),5,7,9,17,19-hexaene-18-carbonitrile | CHEMBL400805
Type:
Small organic molecule
Emp. Form.:
C16H14ClN5O4
Mol. Mass.:
375.766
SMILES:
Oc1cc2OCCCCOc3nc(NC(=O)Nc2cc1Cl)cnc3C#N
: