Target
Serine/threonine-protein kinase Chk1
Ligand
BDBM15250
Substrate
Meas. Tech.
ChEMBL_458388 (CHEMBL942709)
IC50
28±n/a nM
Citation
 Tao, ZFChen, ZBui, MHKovar, PJohnson, EBouska, JZhang, HRosenberg, SSowin, TLin, NH Macrocyclic ureas as potent and selective Chk1 inhibitors: an improved synthesis, kinome profiling, structure-activity relationships, and preliminary pharmacokinetics. Bioorg Med Chem Lett 17:6593-601 (2007)  
Target
Name:
Serine/threonine-protein kinase Chk1
Synonyms:
CHEK1 CHK1 checkpoint homolog Checkpoint kinase-1 (CHK1)
Type:
Enzyme Catalytic Domain
Mol. Mass.:
54443.02
Organism:
Homo sapiens (Human)
Description:
gi_166295192
Residue:
476
  
Inhibitor
Name:
BDBM15250
Synonyms:
7-chloro-3-oxo-11,18-dioxa-2,4,21,23-tetraazatricyclo[17.3.1.0^{5,10}]tricosa-1(22),5(10),6,8,19(23),20-hexaene-20-carbonitrile macrocyclic inhibitor 5d
Type:
Small organic molecule
Emp. Form.:
C18H18ClN5O3
Mol. Mass.:
387.82
SMILES:
Clc1ccc2OCCCCCCOc3nc(NC(=O)Nc2c1)cnc3C#N
: