Target
RAC-alpha serine/threonine-protein kinase
Ligand
BDBM50224883
Substrate
Meas. Tech.
ChEMBL_458398 (CHEMBL942719)
Ki
3698±n/a nM
Citation
 Tao, ZFChen, ZBui, MHKovar, PJohnson, EBouska, JZhang, HRosenberg, SSowin, TLin, NH Macrocyclic ureas as potent and selective Chk1 inhibitors: an improved synthesis, kinome profiling, structure-activity relationships, and preliminary pharmacokinetics. Bioorg Med Chem Lett 17:6593-601 (2007)  
Target
Name:
RAC-alpha serine/threonine-protein kinase
Synonyms:
AKT phosphorylation (p-AKT) AKT1/PPP1CA C-AKT PKB alpha Protein kinase B Protein kinase B (Akt 1) Protein kinase B alpha Proto-oncogene Akt (Akt1) Proto-oncogene c-Akt (AKT1) RAC-PK-alpha RAC-alpha serine/threonine-protein kinase (AKT1) | RAC-alpha serine/threonine-protein kinase (pAKT)
Type:
Enzyme
Mol. Mass.:
55681.25
Organism:
Homo sapiens (Human)
Description:
P31749
Residue:
480
  
Inhibitor
Name:
BDBM50224883
Synonyms:
7-chloro-3-oxo-8-[(thiazol-5-ylmethyl)-amino]-11,16-dioxa-2,4,19,21-tetraaza-tricyclo[15.3.1.0*5,10*]henicosa-1(21),5,7,9,17,19-hexaene-18-crbonitrile | CHEMBL248757
Type:
Small organic molecule
Emp. Form.:
C20H18ClN7O3S
Mol. Mass.:
471.92
SMILES:
Clc1cc2NC(=O)Nc3cnc(C#N)c(OCCCCOc2cc1NCc1cncs1)n3
: