Target
Cyclin-dependent kinase 9
Ligand
BDBM50224883
Substrate
Meas. Tech.
ChEMBL_458422 (CHEMBL942743)
Ki
>1644±n/a nM
Citation
 Tao, ZFChen, ZBui, MHKovar, PJohnson, EBouska, JZhang, HRosenberg, SSowin, TLin, NH Macrocyclic ureas as potent and selective Chk1 inhibitors: an improved synthesis, kinome profiling, structure-activity relationships, and preliminary pharmacokinetics. Bioorg Med Chem Lett 17:6593-601 (2007)  
Target
Name:
Cyclin-dependent kinase 9
Synonyms:
C-2K CDK9 Cell division cycle 2-like protein kinase 4 Cyclin-Dependent Kinase 9 (CDK9) Serine/threonine-protein kinase PITALRE Tat-associated kinase complex catalytic subunit
Type:
Enzyme Subunit
Mol. Mass.:
42789.13
Organism:
Homo sapiens (Human)
Description:
Residue:
372
  
Inhibitor
Name:
BDBM50224883
Synonyms:
7-chloro-3-oxo-8-[(thiazol-5-ylmethyl)-amino]-11,16-dioxa-2,4,19,21-tetraaza-tricyclo[15.3.1.0*5,10*]henicosa-1(21),5,7,9,17,19-hexaene-18-crbonitrile | CHEMBL248757
Type:
Small organic molecule
Emp. Form.:
C20H18ClN7O3S
Mol. Mass.:
471.92
SMILES:
Clc1cc2NC(=O)Nc3cnc(C#N)c(OCCCCOc2cc1NCc1cncs1)n3
: