Target
SRSF protein kinase 3
Ligand
BDBM50224883
Substrate
Meas. Tech.
ChEMBL_458467 (CHEMBL941784)
Ki
>1736±n/a nM
Citation
 Tao, ZFChen, ZBui, MHKovar, PJohnson, EBouska, JZhang, HRosenberg, SSowin, TLin, NH Macrocyclic ureas as potent and selective Chk1 inhibitors: an improved synthesis, kinome profiling, structure-activity relationships, and preliminary pharmacokinetics. Bioorg Med Chem Lett 17:6593-601 (2007)  
Target
Name:
SRSF protein kinase 3
Synonyms:
MSSK-1 Muscle-specific serine kinase 1 SRPK3 SRSF protein kinase 3 Serine/arginine-rich protein-specific kinase 3 Serine/threonine-protein kinase SRPK3
Type:
PROTEIN
Mol. Mass.:
62021.04
Organism:
Homo sapiens (Human)
Description:
ChEMBL_655942
Residue:
567
  
Inhibitor
Name:
BDBM50224883
Synonyms:
7-chloro-3-oxo-8-[(thiazol-5-ylmethyl)-amino]-11,16-dioxa-2,4,19,21-tetraaza-tricyclo[15.3.1.0*5,10*]henicosa-1(21),5,7,9,17,19-hexaene-18-crbonitrile | CHEMBL248757
Type:
Small organic molecule
Emp. Form.:
C20H18ClN7O3S
Mol. Mass.:
471.92
SMILES:
Clc1cc2NC(=O)Nc3cnc(C#N)c(OCCCCOc2cc1NCc1cncs1)n3
: