Target
Melanocortin receptor 3
Ligand
BDBM50230821
Substrate
Meas. Tech.
ChEMBL_460496 (CHEMBL926576)
IC50
1100±n/a nM
Citation
 Mayorov, AVCai, MPalmer, ESDedek, MMCain, JPVan Scoy, ARTan, BVagner, JTrivedi, DHruby, VJ Structure-activity relationships of cyclic lactam analogues of alpha-melanocyte-stimulating hormone (alpha-MSH) targeting the human melanocortin-3 receptor. J Med Chem 51:187-95 (2008)  
Target
Name:
Melanocortin receptor 3
Synonyms:
MC3-R MC3R_HUMAN Melanocortin receptor (M3 and M4)
Type:
Enzyme
Mol. Mass.:
36044.86
Organism:
Homo sapiens (Human)
Description:
P41968
Residue:
323
  
Inhibitor
Name:
BDBM50230821
Synonyms:
CHEMBL438744 | c[CO-2,3-pyrazine-CO-D-Phe-Arg-Trp-Lys]-NH2
Type:
Small organic molecule
Emp. Form.:
C38H46N12O6
Mol. Mass.:
766.8486
SMILES:
NC(N)=NCCC[C@@H]1NC(=O)[C@@H](Cc2ccccc2)NC(=O)c2nccnc2C(=O)NCCCC[C@H](NC(=O)[C@H](Cc2c[nH]c3ccccc23)NC1=O)C(N)=O
: