Target
Melanocortin receptor 4
Ligand
BDBM50230820
Substrate
Meas. Tech.
ChEMBL_460497 (CHEMBL926577)
IC50
>1000±n/a nM
Citation
 Mayorov, AVCai, MPalmer, ESDedek, MMCain, JPVan Scoy, ARTan, BVagner, JTrivedi, DHruby, VJ Structure-activity relationships of cyclic lactam analogues of alpha-melanocyte-stimulating hormone (alpha-MSH) targeting the human melanocortin-3 receptor. J Med Chem 51:187-95 (2008)  
Target
Name:
Melanocortin receptor 4
Synonyms:
MC4-R MC4R_HUMAN Melanocortin receptor 4 (MC-4) Melanocortin receptor 4 (MC4R)
Type:
Enzyme
Mol. Mass.:
36949.50
Organism:
Homo sapiens (Human)
Description:
P32245
Residue:
332
  
Inhibitor
Name:
BDBM50230820
Synonyms:
CHEMBL253789 | c[CO-2,3-pyrazine-CO-D-Nal(2)-Arg-Trp-Lys]-NH2
Type:
Small organic molecule
Emp. Form.:
C42H48N12O6
Mol. Mass.:
816.9073
SMILES:
NC(N)=NCCC[C@@H]1NC(=O)[C@@H](Cc2ccc3ccccc3c2)NC(=O)c2nccnc2C(=O)NCCCC[C@H](NC(=O)[C@H](Cc2c[nH]c3ccccc23)NC1=O)C(N)=O
: