Target
Melanocyte-stimulating hormone receptor
Ligand
BDBM50230824
Substrate
Meas. Tech.
ChEMBL_460498 (CHEMBL926578)
IC50
>10000±n/a nM
Citation
 Mayorov, AVCai, MPalmer, ESDedek, MMCain, JPVan Scoy, ARTan, BVagner, JTrivedi, DHruby, VJ Structure-activity relationships of cyclic lactam analogues of alpha-melanocyte-stimulating hormone (alpha-MSH) targeting the human melanocortin-3 receptor. J Med Chem 51:187-95 (2008)  
Target
Name:
Melanocyte-stimulating hormone receptor
Synonyms:
MC1-R MSH-R MSHR_HUMAN Melanocortin receptor (M1 and M4) Melanocortin receptor 1 (MC1-R) | Melanocortin receptor 1 (MC1R)
Type:
Enzyme
Mol. Mass.:
34717.23
Organism:
Homo sapiens (Human)
Description:
Q01726
Residue:
317
  
Inhibitor
Name:
BDBM50230824
Synonyms:
CHEMBL398665 | c[CO-(CH2)3-CO-Pro-D-Nal(2)-Arg-Trp-Lys]-NH2
Type:
Small organic molecule
Emp. Form.:
C52H63N11O7
Mol. Mass.:
954.1261
SMILES:
NC(=N)NCCC[C@@H]1NC(=O)[C@@H](Cc2ccc3ccccc3c2)NC(=O)[C@@H]2CCCN2C(=O)c2ccccc2C(=O)CCCNCCCC[C@H](NC(=O)[C@H](Cc2c[nH]c3ccccc23)NC1=O)C(N)=O
: