Target
Metabotropic glutamate receptor 5
Ligand
BDBM50231741
Substrate
Meas. Tech.
ChEMBL_460668 (CHEMBL927734)
EC50
172±n/a nM
Citation
 Vanejevs, MJatzke, CRenner, SMüller, SHechenberger, MBauer, TKlochkova, APyatkin, IKazyulkin, DAksenova, EShulepin, STimonina, OHaasis, AGutcaits, AParsons, CGKauss, VWeil, T Positive and negative modulation of group I metabotropic glutamate receptors. J Med Chem 51:634-47 (2008)  
Target
Name:
Metabotropic glutamate receptor 5
Synonyms:
GPRC1E GRM5_HUMAN metabotropic glutamate 5 | metabotropic glutamate 5a
Type:
Enzyme
Mol. Mass.:
132484.72
Organism:
Homo sapiens (Human)
Description:
Residue:
1212
  
Inhibitor
Name:
BDBM50231741
Synonyms:
2-phenylethynyl-7,8-dihydro-6H-quinolin-5-one | CHEMBL252956
Type:
Small organic molecule
Emp. Form.:
C17H13NO
Mol. Mass.:
247.2912
SMILES:
O=C1CCCc2nc(ccc12)C#Cc1ccccc1
: