Target
Metabotropic glutamate receptor 5
Ligand
BDBM50231719
Substrate
Meas. Tech.
ChEMBL_460668 (CHEMBL927734)
EC50
1130±n/a nM
Citation
 Vanejevs, MJatzke, CRenner, SMüller, SHechenberger, MBauer, TKlochkova, APyatkin, IKazyulkin, DAksenova, EShulepin, STimonina, OHaasis, AGutcaits, AParsons, CGKauss, VWeil, T Positive and negative modulation of group I metabotropic glutamate receptors. J Med Chem 51:634-47 (2008)  
Target
Name:
Metabotropic glutamate receptor 5
Synonyms:
GPRC1E GRM5_HUMAN metabotropic glutamate 5 | metabotropic glutamate 5a
Type:
Enzyme
Mol. Mass.:
132484.72
Organism:
Homo sapiens (Human)
Description:
Residue:
1212
  
Inhibitor
Name:
BDBM50231719
Synonyms:
2-phenylethynyl-5,6,7,8-tetrahydro-quinolin-5-ol | CHEMBL253157
Type:
Small organic molecule
Emp. Form.:
C17H15NO
Mol. Mass.:
249.3071
SMILES:
OC1CCCc2nc(ccc12)C#Cc1ccccc1
: