Target
Xaa-Pro aminopeptidase 1
Ligand
BDBM50232503
Substrate
Meas. Tech.
ChEMBL_461054 (CHEMBL944086)
IC50
>10000±n/a nM
Citation
 Kim, DKowalchick, JEBrockunier, LLParmee, EREiermann, GJFisher, MHHe, HLeiting, BLyons, KScapin, GPatel, SBPetrov, APryor, KDRoy, RSWu, JKZhang, XWyvratt, MJZhang, BBZhu, LThornberry, NAWeber, AE Discovery of potent and selective dipeptidyl peptidase IV inhibitors derived from beta-aminoamides bearing subsituted triazolopiperazines. J Med Chem 51:589-602 (2008)  
Target
Name:
Xaa-Pro aminopeptidase 1
Synonyms:
Aminoacylproline aminopeptidase Soluble aminopeptidase P X-prolyl aminopeptidase 1, soluble XPNPEPL XPP1_HUMAN | sAmp
Type:
PROTEIN
Mol. Mass.:
69905.93
Organism:
Homo sapiens (Human)
Description:
ChEMBL_461054
Residue:
623
  
Inhibitor
Name:
BDBM50232503
Synonyms:
(2R)-4-[8-(4-methoxybenzyl)-3-(trifluoromethyl)-5,6-dihydro[1,2,4]triazolo[4,3-a]pyrazin-7(8H)-yl]-4-oxo-1-(2,4,5-trifluorophenyl)butan-2-amine hydrochloride | CHEMBL539352
Type:
Small organic molecule
Emp. Form.:
C24H23F6N5O2
Mol. Mass.:
527.4621
SMILES:
COc1ccc(CC2N(CCn3c2nnc3C(F)(F)F)C(=O)C[C@H](N)Cc2cc(F)c(F)cc2F)cc1
: