Target
Xaa-Pro aminopeptidase 1
Ligand
BDBM50151843
Substrate
Meas. Tech.
ChEMBL_461054 (CHEMBL944086)
IC50
>10000±n/a nM
Citation
 Kim, DKowalchick, JEBrockunier, LLParmee, EREiermann, GJFisher, MHHe, HLeiting, BLyons, KScapin, GPatel, SBPetrov, APryor, KDRoy, RSWu, JKZhang, XWyvratt, MJZhang, BBZhu, LThornberry, NAWeber, AE Discovery of potent and selective dipeptidyl peptidase IV inhibitors derived from beta-aminoamides bearing subsituted triazolopiperazines. J Med Chem 51:589-602 (2008)  
Target
Name:
Xaa-Pro aminopeptidase 1
Synonyms:
Aminoacylproline aminopeptidase Soluble aminopeptidase P X-prolyl aminopeptidase 1, soluble XPNPEPL XPP1_HUMAN | sAmp
Type:
PROTEIN
Mol. Mass.:
69905.93
Organism:
Homo sapiens (Human)
Description:
ChEMBL_461054
Residue:
623
  
Inhibitor
Name:
BDBM50151843
Synonyms:
(R)-3-Amino-1-((R)-2-benzyl-piperazin-1-yl)-4-(2-fluoro-phenyl)-butan-1-one 3-Amino-1-((R)-2-benzyl-piperazin-1-yl)-4-((R)-2-fluoro-phenyl)-butan-1-one | CHEMBL175872
Type:
Small organic molecule
Emp. Form.:
C21H26FN3O
Mol. Mass.:
355.449
SMILES:
N[C@@H](CC(=O)N1CCNC[C@H]1Cc1ccccc1)Cc1ccccc1F
: