Target
Adenosine receptor A1
Ligand
BDBM50224780
Substrate
Meas. Tech.
ChEMBL_461282 (CHEMBL927300)
Ki
9800±n/a nM
Citation
 Cappellacci, LFranchetti, PVita, PPetrelli, RLavecchia, ACosta, BSpinetti, FMartini, CKlotz, KNGrifantini, M 5'-Carbamoyl derivatives of 2'-C-methyl-purine nucleosides as selective A1 adenosine receptor agonists: affinity, efficacy, and selectivity for A1 receptor from different species. Bioorg Med Chem 16:336-53 (2008)  
Target
Name:
Adenosine receptor A1
Synonyms:
A1 adenosine receptor ADENOSINE A1 ADENOSINE A1 low Adenosine A1 receptor | Adenosine Receptor A1
Type:
Enzyme Catalytic Domain
Mol. Mass.:
36501.39
Organism:
GUINEA PIG
Description:
ADENOSINE A1 ADORA1 GUINEA PIG::P47745
Residue:
326
  
Inhibitor
Name:
BDBM50224780
Synonyms:
CHEMBL398543 | N6-(R)-3-tetrahydrofuranyl-9H-(2-C-methyl-5-N-benzylthiocarbamoyl-beta-D-ribofuranosyl)adenine
Type:
Small organic molecule
Emp. Form.:
C23H28N6O5S
Mol. Mass.:
500.571
SMILES:
C[C@@]1(O)[C@H](O)[C@@H](COC(=S)NCc2ccccc2)O[C@H]1n1cnc2c(N[C@@H]3CCOC3)ncnc12
: