Target
Adenosine receptor A1
Ligand
BDBM50224777
Substrate
Meas. Tech.
ChEMBL_461282 (CHEMBL927300)
Ki
1848±n/a nM
Citation
 Cappellacci, LFranchetti, PVita, PPetrelli, RLavecchia, ACosta, BSpinetti, FMartini, CKlotz, KNGrifantini, M 5'-Carbamoyl derivatives of 2'-C-methyl-purine nucleosides as selective A1 adenosine receptor agonists: affinity, efficacy, and selectivity for A1 receptor from different species. Bioorg Med Chem 16:336-53 (2008)  
Target
Name:
Adenosine receptor A1
Synonyms:
A1 adenosine receptor ADENOSINE A1 ADENOSINE A1 low Adenosine A1 receptor | Adenosine Receptor A1
Type:
Enzyme Catalytic Domain
Mol. Mass.:
36501.39
Organism:
GUINEA PIG
Description:
ADENOSINE A1 ADORA1 GUINEA PIG::P47745
Residue:
326
  
Inhibitor
Name:
BDBM50224777
Synonyms:
2-chloro-N6-(R)-3-tetrahydrofuranyl-9H-(2-C-methyl-5-N-propylcarbamoyl-beta-D-ribofuranosyl)adenine | CHEMBL398544
Type:
Small organic molecule
Emp. Form.:
C19H27ClN6O6
Mol. Mass.:
470.907
SMILES:
CCCNC(=O)OC[C@H]1O[C@@H](n2cnc3c(N[C@@H]4CCOC4)nc(Cl)nc23)[C@](C)(O)[C@@H]1O
: