Target
Acetylcholinesterase
Ligand
BDBM50231951
Substrate
Meas. Tech.
ChEMBL_462117 (CHEMBL945890)
Ki
2.6±n/a nM
Citation
 Cavalli, ABolognesi, MLMinarini, ARosini, MTumiatti, VRecanatini, MMelchiorre, C Multi-target-directed ligands to combat neurodegenerative diseases. J Med Chem 51:347-72 (2008)  
Target
Name:
Acetylcholinesterase
Synonyms:
ACES_HUMAN Acetylcholinesterase (AChE) | Acetylcholinesterase (human AChE)
Type:
Enzyme
Mol. Mass.:
67792.70
Organism:
Homo sapiens (Human)
Description:
P22303
Residue:
614
  
Inhibitor
Name:
BDBM50231951
Synonyms:
2,5-bis(6-((2-methoxybenzyl)(ethyl)amino)hexylamino)cyclohexa-2,5-diene-1,4-dione CHEMBL231160 | memoquin
Type:
Small organic molecule
Emp. Form.:
C38H56N4O4
Mol. Mass.:
632.8756
SMILES:
CCN(CCCCCCNc1cc(O)c(cc1O)N=CCCCCCN(CC)Cc1ccccc1OC)Cc1ccccc1OC
: