Target
Amine oxidase [flavin-containing] B
Ligand
BDBM50231950
Substrate
Meas. Tech.
ChEMBL_462121 (CHEMBL945895)
IC50
57±n/a nM
Citation
 Cavalli, ABolognesi, MLMinarini, ARosini, MTumiatti, VRecanatini, MMelchiorre, C Multi-target-directed ligands to combat neurodegenerative diseases. J Med Chem 51:347-72 (2008)  
Target
Name:
Amine oxidase [flavin-containing] B
Synonyms:
AOFB_HUMAN MAOB Monoamine oxidase type B (MAO B) Monoamine oxidase type B (MAOB)
Type:
Protein
Mol. Mass.:
58768.76
Organism:
Homo sapiens (Human)
Description:
P27338
Residue:
520
  
Inhibitor
Name:
BDBM50231950
Synonyms:
4-((methyl(prop-2-ynyl)amino)methyl)quinolin-8-ol | CHEMBL258420
Type:
Small organic molecule
Emp. Form.:
C14H14N2O
Mol. Mass.:
226.2738
SMILES:
CN(CC#C)Cc1ccnc2c(O)cccc12
: