Target
Acetylcholinesterase
Ligand
BDBM50175500
Substrate
Meas. Tech.
ChEMBL_462117 (CHEMBL945890)
IC50
101±n/a nM
Citation
 Cavalli, ABolognesi, MLMinarini, ARosini, MTumiatti, VRecanatini, MMelchiorre, C Multi-target-directed ligands to combat neurodegenerative diseases. J Med Chem 51:347-72 (2008)  
Target
Name:
Acetylcholinesterase
Synonyms:
ACES_HUMAN Acetylcholinesterase (AChE) | Acetylcholinesterase (human AChE)
Type:
Enzyme
Mol. Mass.:
67792.70
Organism:
Homo sapiens (Human)
Description:
P22303
Residue:
614
  
Inhibitor
Name:
BDBM50175500
Synonyms:
(S)-4-(1-(methylamino)-3-(4-nitrophenoxy)propyl)phenyl dimethylcarbamate Dimethyl-carbamic acid 4-[(S)-1-methylamino-3-(4-nitro-phenoxy)-propyl]-phenyl ester
Type:
Small organic molecule
Emp. Form.:
C19H23N3O5
Mol. Mass.:
373.403
SMILES:
CN[C@@H](CCOc1ccc(cc1)[N+]([O-])=O)c1ccc(OC(=O)N(C)C)cc1
: