Target
Amine oxidase [flavin-containing] B
Ligand
BDBM50231956
Substrate
Meas. Tech.
ChEMBL_462121 (CHEMBL945895)
IC50
51000±n/a nM
Citation
 Cavalli, ABolognesi, MLMinarini, ARosini, MTumiatti, VRecanatini, MMelchiorre, C Multi-target-directed ligands to combat neurodegenerative diseases. J Med Chem 51:347-72 (2008)  
Target
Name:
Amine oxidase [flavin-containing] B
Synonyms:
AOFB_HUMAN MAOB Monoamine oxidase type B (MAO B) Monoamine oxidase type B (MAOB)
Type:
Protein
Mol. Mass.:
58768.76
Organism:
Homo sapiens (Human)
Description:
P27338
Residue:
520
  
Inhibitor
Name:
BDBM50231956
Synonyms:
(Z)-8-bromo-4-methyl-3-(methylimino)-1,2,3,4-tetrahydrocyclopenta[b]indol-7-yl dimethylcarbamate Dimethyl-carbamic acid 8-bromo-4-methyl-3-[(Z)-methylimino]-1,2,3,4-tetrahydro-cyclopenta[b]indol-7-yl ester
Type:
Small organic molecule
Emp. Form.:
C16H18BrN3O2
Mol. Mass.:
364.237
SMILES:
CN=C1CCc2c1n(C)c1ccc(OC(=O)N(C)C)c(Br)c21
: