Target
Amine oxidase [flavin-containing] B
Ligand
BDBM50231959
Substrate
Meas. Tech.
ChEMBL_462121 (CHEMBL945895)
IC50
4240±n/a nM
Citation
 Cavalli, ABolognesi, MLMinarini, ARosini, MTumiatti, VRecanatini, MMelchiorre, C Multi-target-directed ligands to combat neurodegenerative diseases. J Med Chem 51:347-72 (2008)  
Target
Name:
Amine oxidase [flavin-containing] B
Synonyms:
AOFB_HUMAN MAOB Monoamine oxidase type B (MAO B) Monoamine oxidase type B (MAOB)
Type:
Protein
Mol. Mass.:
58768.76
Organism:
Homo sapiens (Human)
Description:
P27338
Residue:
520
  
Inhibitor
Name:
BDBM50231959
Synonyms:
4-((prop-2-ynylamino)methyl)quinolin-8-ol | CHEMBL255700
Type:
Small organic molecule
Emp. Form.:
C13H12N2O
Mol. Mass.:
212.2472
SMILES:
Oc1cccc2c(CNCC#C)ccnc12
: