Target
Acetylcholinesterase
Ligand
BDBM29400
Substrate
Meas. Tech.
ChEMBL_462117 (CHEMBL945890)
IC50
45±n/a nM
Citation
 Cavalli, ABolognesi, MLMinarini, ARosini, MTumiatti, VRecanatini, MMelchiorre, C Multi-target-directed ligands to combat neurodegenerative diseases. J Med Chem 51:347-72 (2008)  
Target
Name:
Acetylcholinesterase
Synonyms:
ACES_HUMAN Acetylcholinesterase (AChE) | Acetylcholinesterase (human AChE)
Type:
Enzyme
Mol. Mass.:
67792.70
Organism:
Homo sapiens (Human)
Description:
P22303
Residue:
614
  
Inhibitor
Name:
BDBM29400
Synonyms:
CHEMBL374184 | tacrine-dihydropyridine hybrid (tacripyrine), 11
Type:
Small organic molecule
Emp. Form.:
C23H27N3O3
Mol. Mass.:
393.4788
SMILES:
CCOC(=O)C1C(c2ccc(OC)cc2)c2c(N)c3CCCCc3nc2N=C1C
: