Target
Cathepsin S
Ligand
BDBM50233037
Substrate
Meas. Tech.
ChEMBL_462248 (CHEMBL945082)
IC50
>10000±n/a nM
Citation
 Gauthier, JYChauret, NCromlish, WDesmarais, SDuong, le TFalgueyret, JPKimmel, DBLamontagne, SLéger, SLeRiche, TLi, CSMassé, FMcKay, DJNicoll-Griffith, DAOballa, RMPalmer, JTPercival, MDRiendeau, DRobichaud, JRodan, GARodan, SBSeto, CThérien, MTruong, VLVenuti, MCWesolowski, GYoung, RNZamboni, RBlack, WC The discovery of odanacatib (MK-0822), a selective inhibitor of cathepsin K. Bioorg Med Chem Lett 18:923-8 (2008)  
Target
Name:
Cathepsin S
Synonyms:
CATS_HUMAN Cathepsin S (Cat S) | cathepsin S preproprotein
Type:
Protein
Mol. Mass.:
37507.38
Organism:
Homo sapiens (Human)
Description:
P25774
Residue:
331
  
Inhibitor
Name:
BDBM50233037
Synonyms:
(S)-4-methyl-2-[(S)-2,2,2-trifluoro-1-(4'-methanesulfonyl-biphenyl-4-yl)-ethylamino]-pentanoic acid (cyano-dicyclobutyl-methyl)-amide | CHEMBL252581
Type:
Small organic molecule
Emp. Form.:
C31H38F3N3O3S
Mol. Mass.:
589.712
SMILES:
CC(C)C[C@H](N[C@@H](c1ccc(cc1)-c1ccc(cc1)S(C)(=O)=O)C(F)(F)F)C(=O)NC(C#N)(C1CCC1)C1CCC1
: