Target
Beta-secretase 1
Ligand
BDBM50371472
Substrate
Meas. Tech.
ChEMBL_463672 (CHEMBL929819)
IC50
121±n/a nM
Citation
 Piazzi, LCavalli, AColizzi, FBelluti, FBartolini, MMancini, FRecanatini, MAndrisano, VRampa, A Multi-target-directed coumarin derivatives: hAChE and BACE1 inhibitors as potential anti-Alzheimer compounds. Bioorg Med Chem Lett 18:423-6 (2008)  
Target
Name:
Beta-secretase 1
Synonyms:
ASP2 Aspartyl protease 2 BACE1 Beta-secretase (BACE) Beta-secretase 1 (BACE 1) Beta-secretase 1 (BACE1) Beta-site amyloid precursor protein cleaving enzyme 1 Memapsin-2 beta-Secretase (BACE-1) | beta-Secretase (BACE1)
Type:
Protein
Mol. Mass.:
55755.10
Organism:
Homo sapiens (Human)
Description:
P56817
Residue:
501
  
Inhibitor
Name:
BDBM50371472
Synonyms:
CHEMBL271709
Type:
Small organic molecule
Emp. Form.:
C36H32F2N2O4
Mol. Mass.:
594.6471
SMILES:
CCN(Cc1ccccc1)Cc1ccc(cc1)-c1cc2ccc(OCCNC(=O)\C=C\c3cc(F)cc(F)c3)cc2oc1=O
: