Target
Ectonucleoside triphosphate diphosphohydrolase 1
Ligand
BDBM50336767
Substrate
Meas. Tech.
ChEMBL_463990 (CHEMBL929977)
Ki
>100000±n/a nM
Citation
 Weyler, SBaqi, YHillmann, PKaulich, MHunder, AMMüller, IAMüller, CE Combinatorial synthesis of anilinoanthraquinone derivatives and evaluation as non-nucleotide-derived P2Y2 receptor antagonists. Bioorg Med Chem Lett 18:223-7 (2008)  
Target
Name:
Ectonucleoside triphosphate diphosphohydrolase 1
Synonyms:
ATPDase Cd39 Ecto-ATP diphosphohydrolase Entpd1 NTPDase 1
Type:
PROTEIN
Mol. Mass.:
57412.31
Organism:
Rattus norvegicus
Description:
ChEMBL_463990
Residue:
511
  
Inhibitor
Name:
BDBM50336767
Synonyms:
CHEMBL257495 sodium 1-amino-4-(2-methoxyphenylamino)-9,10-dioxo-9,10-dihydroanthracene-2-sulfonate
Type:
Small organic molecule
Emp. Form.:
C21H15N2O6S
Mol. Mass.:
423.419
SMILES:
COc1ccccc1Nc1cc(c(N)c2C(=O)c3ccccc3C(=O)c12)S([O-])(=O)=O
: