Target
Melanin-concentrating hormone receptor 1
Ligand
BDBM50371868
Substrate
Meas. Tech.
ChEMBL_464119 (CHEMBL948282)
EC50
20±n/a nM
Citation
 Erickson, SDBanner, BBerthel, SConde-Knape, KFalcioni, FHakimi, IHennessy, BKester, RFKim, KMa, CMcComas, WMennona, FMischke, SOrzechowski, LQian, YSalari, HTengi, JThakkar, KTaub, RTilley, JWWang, H Potent, selective MCH-1 receptor antagonists. Bioorg Med Chem Lett 18:1402-6 (2008)  
Target
Name:
Melanin-concentrating hormone receptor 1
Synonyms:
G-protein coupled receptor 24 MCH receptor 1 MCH-R1 MCHR-1 MCHR1_HUMAN Melanin-Concentrating Hormone Receptor 1 (MCH1R) Melanin-concentrating hormone receptor 1 (MCH-1) Melanin-concentrating hormone receptor 1 (MCHR-1) SLC-1 Somatostatin receptor-like protein
Type:
G Protein-Coupled Receptor (GPCR)
Mol. Mass.:
45976.27
Organism:
Homo sapiens (Human)
Description:
Membranes from CHO-K1 cells stably expressing human MCH1R were used in assays.
Residue:
422
  
Inhibitor
Name:
BDBM50371868
Synonyms:
CHEMBL269939
Type:
Small organic molecule
Emp. Form.:
C25H30BrN3O
Mol. Mass.:
468.429
SMILES:
CO[C@@H]1CN(C[C@H]2Cc3ccc(Br)cc3C2)CC[C@H]1n1c(C)nc2cc(C)ccc12
: