Target
Fatty-acid amide hydrolase 1
Ligand
BDBM50204493
Substrate
Meas. Tech.
ChEMBL_464337 (CHEMBL951191)
IC50
43±n/a nM
Citation
 Timmons, ASeierstad, MApodaca, REpperson, MPippel, DBrown, SChang, LScott, BWebb, MChaplan, SRBreitenbucher, JG Novel ketooxazole based inhibitors of fatty acid amide hydrolase (FAAH). Bioorg Med Chem Lett 18:2109-13 (2008)  
Target
Name:
Fatty-acid amide hydrolase 1
Synonyms:
Anandamide amidohydrolase FAAH FAAH1_HUMAN Fatty-acid amide hydrolase (FAAH) Oleamide hydrolase 1
Type:
Protein
Mol. Mass.:
63071.19
Organism:
Homo sapiens (Human)
Description:
O00519
Residue:
579
  
Inhibitor
Name:
BDBM50204493
Synonyms:
1-(oxazol-2-yl)-7-phenylheptan-1-one | CHEMBL220125
Type:
Small organic molecule
Emp. Form.:
C16H19NO2
Mol. Mass.:
257.3276
SMILES:
O=C(CCCCCCc1ccccc1)c1ncco1
: