Target
5-hydroxytryptamine receptor 7
Ligand
BDBM50371980
Substrate
Meas. Tech.
ChEMBL_464406 (CHEMBL930056)
Ki
4.2±n/a nM
Citation
 Peters, JULübbers, TAlanine, AKolczewski, SBlasco, FSteward, L Cyclic guanidines as dual 5-HT5A/5-HT7 receptor ligands: optimising brain penetration. Bioorg Med Chem Lett 18:262-6 (2008)  
Target
Name:
5-hydroxytryptamine receptor 7
Synonyms:
5-HT-7 5-HT7 5-HT7S 5HT7 HTR7 | Serotonin receptor 7
Type:
G Protein-Coupled Receptor (GPCR)
Mol. Mass.:
53573.08
Organism:
Homo sapiens (Human)
Description:
P34969
Residue:
479
  
Inhibitor
Name:
BDBM50371980
Synonyms:
CHEMBL446459
Type:
Small organic molecule
Emp. Form.:
C14H19F2N3O
Mol. Mass.:
283.317
SMILES:
CC(C)Oc1cccc2C(C)NC(NCC(F)F)=Nc12
: