Target
C-X-C chemokine receptor type 3
Ligand
BDBM50227863
Substrate
Meas. Tech.
ChEMBL_464453 (CHEMBL948053)
Ki
9±n/a nM
Citation
 Knight, RLAllen, DRBirch, HLChapman, GAGalvin, FCJopling, LALock, CJMeissner, JWOwen, DARaphy, GWatson, RJWilliams, SC Development of CXCR3 antagonists. Part 4: discovery of 2-amino-(4-tropinyl)quinolines. Bioorg Med Chem Lett 18:629-33 (2008)  
Target
Name:
C-X-C chemokine receptor type 3
Synonyms:
AAO92295.1 C-X-C chemokine receptor type 3 (CXCR3) CXCR3 CXCR3_HUMAN chemokine (C-X-C motif) receptor 3
Type:
Enzyme Catalytic Domain
Mol. Mass.:
40665.65
Organism:
Homo sapiens (Human)
Description:
Residue:
368
  
Inhibitor
Name:
BDBM50227863
Synonyms:
1-(1-((9-acetyl-9-aza-bicyclo[3.3.1]non-2-en-3-yl)methyl)piperidin-4-yl)-3-(3-fluoro-5-(trifluoromethyl)phenyl)urea | CHEMBL404736
Type:
Small organic molecule
Emp. Form.:
C24H30F4N4O2
Mol. Mass.:
482.5142
SMILES:
CC(=O)N1C2CCCC1C=C(CN1CCC(CC1)NC(=O)Nc1cc(F)cc(c1)C(F)(F)F)C2
: