Target
C-X-C chemokine receptor type 3
Ligand
BDBM50372010
Substrate
Meas. Tech.
ChEMBL_464453 (CHEMBL948053)
Ki
25±n/a nM
Citation
 Knight, RLAllen, DRBirch, HLChapman, GAGalvin, FCJopling, LALock, CJMeissner, JWOwen, DARaphy, GWatson, RJWilliams, SC Development of CXCR3 antagonists. Part 4: discovery of 2-amino-(4-tropinyl)quinolines. Bioorg Med Chem Lett 18:629-33 (2008)  
Target
Name:
C-X-C chemokine receptor type 3
Synonyms:
AAO92295.1 C-X-C chemokine receptor type 3 (CXCR3) CXCR3 CXCR3_HUMAN chemokine (C-X-C motif) receptor 3
Type:
Enzyme Catalytic Domain
Mol. Mass.:
40665.65
Organism:
Homo sapiens (Human)
Description:
Residue:
368
  
Inhibitor
Name:
BDBM50372010
Synonyms:
CHEMBL402245
Type:
Small organic molecule
Emp. Form.:
C28H38N4O2
Mol. Mass.:
462.6269
SMILES:
CC(C)Oc1ccc2ccc(NC3CCN(CC4=CC5CCCC(C4)N5C(C)=O)CC3)nc2c1
: