Target
C-X-C chemokine receptor type 3
Ligand
BDBM50372012
Substrate
Meas. Tech.
ChEMBL_464453 (CHEMBL948053)
Ki
18±n/a nM
Citation
 Knight, RLAllen, DRBirch, HLChapman, GAGalvin, FCJopling, LALock, CJMeissner, JWOwen, DARaphy, GWatson, RJWilliams, SC Development of CXCR3 antagonists. Part 4: discovery of 2-amino-(4-tropinyl)quinolines. Bioorg Med Chem Lett 18:629-33 (2008)  
Target
Name:
C-X-C chemokine receptor type 3
Synonyms:
AAO92295.1 C-X-C chemokine receptor type 3 (CXCR3) CXCR3 CXCR3_HUMAN chemokine (C-X-C motif) receptor 3
Type:
Enzyme Catalytic Domain
Mol. Mass.:
40665.65
Organism:
Homo sapiens (Human)
Description:
Residue:
368
  
Inhibitor
Name:
BDBM50372012
Synonyms:
CHEMBL404028
Type:
Small organic molecule
Emp. Form.:
C26H31F3N4O2
Mol. Mass.:
488.5451
SMILES:
CC(=O)N1C2CCCC1C=C(CN1CCC(CC1)Nc1ccc3cc(OC(F)(F)F)ccc3n1)C2
: