Target
Adenosine receptor A2a
Ligand
BDBM50372024
Substrate
Meas. Tech.
ChEMBL_464500 (CHEMBL931999)
IC50
11±n/a nM
Citation
 Mantell, SJStephenson, PTMonaghan, SMMaw, GNTrevethick, MAYeadon, MKeir, RFWalker, DKJones, RMSelby, MDBatchelor, DVRozze, SChavaroche, HHobson, TJDodd, PGLemaitre, AWright, KNStuart, EF Inhaled adenosine A(2A) receptor agonists for the treatment of chronic obstructive pulmonary disease. Bioorg Med Chem Lett 18:1284-7 (2008)  
Target
Name:
Adenosine receptor A2a
Synonyms:
A2A adenosine receptor (hA2A) ADENOSINE A2 ADORA2 Adenosine A2A receptor (A2AAR)
Type:
G Protein-Coupled Receptor (GPCR)
Mol. Mass.:
44716.46
Organism:
Homo sapiens (Human)
Description:
P29274
Residue:
412
  
Inhibitor
Name:
BDBM50372024
Synonyms:
CHEMBL257213
Type:
Small organic molecule
Emp. Form.:
C36H49N9O5
Mol. Mass.:
687.8316
SMILES:
CCNC(=O)[C@H]1O[C@H]([C@H](O)[C@@H]1O)n1cnc2c(NCC(c3ccccc3)c3ccccc3)nc(CNC(=O)NCCN(C(C)C)C(C)C)nc12
: