Target
Adenosine receptor A2a
Ligand
BDBM50233810
Substrate
Meas. Tech.
ChEMBL_464500 (CHEMBL931999)
IC50
65±n/a nM
Citation
 Mantell, SJStephenson, PTMonaghan, SMMaw, GNTrevethick, MAYeadon, MKeir, RFWalker, DKJones, RMSelby, MDBatchelor, DVRozze, SChavaroche, HHobson, TJDodd, PGLemaitre, AWright, KNStuart, EF Inhaled adenosine A(2A) receptor agonists for the treatment of chronic obstructive pulmonary disease. Bioorg Med Chem Lett 18:1284-7 (2008)  
Target
Name:
Adenosine receptor A2a
Synonyms:
A2A adenosine receptor (hA2A) ADENOSINE A2 ADORA2 Adenosine A2A receptor (A2AAR)
Type:
G Protein-Coupled Receptor (GPCR)
Mol. Mass.:
44716.46
Organism:
Homo sapiens (Human)
Description:
P29274
Residue:
412
  
Inhibitor
Name:
BDBM50233810
Synonyms:
9-((2R,3R,4S,5R)-3,4-dihydroxy-5-(hydroxymethyl)-tetrahydrofuran-2-yl)-6-(2,2-diphenylethylamino)-N-(2-(piperidin-1-yl)ethyl)-9H-purine-2-carboxamide CHEMBL256467
Type:
Small organic molecule
Emp. Form.:
C32H39N7O5
Mol. Mass.:
601.696
SMILES:
OC[C@H]1O[C@H]([C@H](O)[C@@H]1O)n1cnc2c(NCC(c3ccccc3)c3ccccc3)nc(nc12)C(=O)NCCN1CCCCC1
: