Target
Prostaglandin E2 receptor EP4 subtype
Ligand
BDBM50372077
Substrate
Meas. Tech.
ChEMBL_464678 (CHEMBL934070)
Ki
0.43±n/a nM
Citation
 Burch, JDBelley, MFortin, RDeschênes, DGirard, MColucci, JFarand, JTherien, AGMathieu, MCDenis, DVigneault, ELévesque, JFGagné, SWrona, MXu, DClark, PRowland, SHan, Y Structure-activity relationships and pharmacokinetic parameters of quinoline acylsulfonamides as potent and selective antagonists of the EP(4) receptor. Bioorg Med Chem Lett 18:2048-54 (2008)  
Target
Name:
Prostaglandin E2 receptor EP4 subtype
Synonyms:
PE2R4_HUMAN PGE2 receptor EP4 subtype PTGER4 Prostanoid EP4 receptor
Type:
Enzyme
Mol. Mass.:
53134.53
Organism:
Homo sapiens (Human)
Description:
P35408
Residue:
488
  
Inhibitor
Name:
BDBM50372077
Synonyms:
CHEMBL271070
Type:
Small organic molecule
Emp. Form.:
C34H36N2O6S
Mol. Mass.:
600.724
SMILES:
CCOc1c2CN(C(=O)c2c(OCC)c2ccccc12)c1ccc(CS(=O)(=O)NC(=O)Cc2c(C)cc(C)cc2C)cc1
: