Target
Vascular endothelial growth factor receptor 2
Ligand
BDBM50372141
Substrate
Meas. Tech.
ChEMBL_464752 (CHEMBL930118)
IC50
1.3±n/a nM
Citation
 Dai, YHartandi, KSoni, NBPease, LJReuter, DROlson, AMOsterling, DJDoktor, SZAlbert, DHBouska, JJGlaser, KBMarcotte, PAStewart, KDDavidsen, SKMichaelides, MR Identification of aminopyrazolopyridine ureas as potent VEGFR/PDGFR multitargeted kinase inhibitors. Bioorg Med Chem Lett 18:386-90 (2008)  
Target
Name:
Vascular endothelial growth factor receptor 2
Synonyms:
CD_antigen=CD309 Fetal liver kinase 1 (FLK-1) KDR Protein-tyrosine kinase receptor Flk-1 VEGFR-2 VEGFR2 Vascular Endothelial Growth Factor Receptor Kinase 2 Vascular endothelial growth factor receptor 2 (KDR) Vascular endothelial growth factor receptor 2 (VEGFR2) Vascular endothelial growth factor receptor-2 (VEGFR-2)
Type:
Receptor Tyrosine Kinase
Mol. Mass.:
151510.97
Organism:
Homo sapiens (Human)
Description:
P35968
Residue:
1356
  
Inhibitor
Name:
BDBM50372141
Synonyms:
CHEMBL256246
Type:
Small organic molecule
Emp. Form.:
C20H14F4N6O
Mol. Mass.:
430.3584
SMILES:
Nc1n[nH]c2cncc(-c3ccc(NC(=O)Nc4cc(ccc4F)C(F)(F)F)cc3)c12
: