Target
Receptor-type tyrosine-protein kinase FLT3
Ligand
BDBM50372153
Substrate
Meas. Tech.
ChEMBL_464760 (CHEMBL930126)
IC50
2±n/a nM
Citation
 Dai, YHartandi, KSoni, NBPease, LJReuter, DROlson, AMOsterling, DJDoktor, SZAlbert, DHBouska, JJGlaser, KBMarcotte, PAStewart, KDDavidsen, SKMichaelides, MR Identification of aminopyrazolopyridine ureas as potent VEGFR/PDGFR multitargeted kinase inhibitors. Bioorg Med Chem Lett 18:386-90 (2008)  
Target
Name:
Receptor-type tyrosine-protein kinase FLT3
Synonyms:
CD135 FL cytokine receptor FLK2 FLT3 Fetal liver kinase-2 Fms-like tyrosine kinase 3 (Flt-3) STK-1 Stem cell tyrosine kinase 1
Type:
Enzyme
Mol. Mass.:
112888.62
Organism:
Homo sapiens (Human)
Description:
P36888
Residue:
993
  
Inhibitor
Name:
BDBM50372153
Synonyms:
CHEMBL255955
Type:
Small organic molecule
Emp. Form.:
C20H15F3N6O
Mol. Mass.:
412.3679
SMILES:
Nc1n[nH]c2nccc(-c3ccc(NC(=O)Nc4cccc(c4)C(F)(F)F)cc3)c12
: