Target
Bcl-2-like protein 2
Ligand
BDBM50372172
Substrate
Meas. Tech.
ChEMBL_464768 (CHEMBL930134)
Ki
116000±n/a nM
Citation
 Wang, LKong, FKokoski, CLAndrews, DWXing, C Development of dimeric modulators for anti-apoptotic Bcl-2 proteins. Bioorg Med Chem Lett 18:236-40 (2008)  
Target
Name:
Bcl-2-like protein 2
Synonyms:
Apoptosis regulator Bcl-W BCL-W BCLW Bcl2-L-2 | KIAA0271
Type:
Protein
Mol. Mass.:
20742.61
Organism:
Homo sapiens (Human)
Description:
Residue:
193
  
Inhibitor
Name:
BDBM50372172
Synonyms:
CHEMBL257687
Type:
Small organic molecule
Emp. Form.:
C21H18BrNO3S2
Mol. Mass.:
476.407
SMILES:
CCOC(=O)[C@H](Cc1ccccc1)N1C(=S)S\C(=C/c2ccc(Br)cc2)C1=O
: