Target
Beta-secretase 1
Ligand
BDBM50372185
Substrate
Meas. Tech.
ChEMBL_464801 (CHEMBL946840)
IC50
482±n/a nM
Citation
 Iserloh, UWu, YCumming, JNPan, JWang, LYStamford, AWKennedy, MEKuvelkar, RChen, XParker, EMStrickland, CVoigt, J Potent pyrrolidine- and piperidine-based BACE-1 inhibitors. Bioorg Med Chem Lett 18:414-7 (2008)  
Target
Name:
Beta-secretase 1
Synonyms:
ASP2 Aspartyl protease 2 BACE1 Beta-secretase (BACE) Beta-secretase 1 (BACE 1) Beta-secretase 1 (BACE1) Beta-site amyloid precursor protein cleaving enzyme 1 Memapsin-2 beta-Secretase (BACE-1) | beta-Secretase (BACE1)
Type:
Protein
Mol. Mass.:
55755.10
Organism:
Homo sapiens (Human)
Description:
P56817
Residue:
501
  
Inhibitor
Name:
BDBM50372185
Synonyms:
CHEMBL256372
Type:
Small organic molecule
Emp. Form.:
C33H48F2N4O4
Mol. Mass.:
602.7554
SMILES:
CCCN(CCC)C(=O)c1cc(C)cc(c1)C(=O)N[C@@H](Cc1cc(F)cc(F)c1)[C@H](O)[C@H]1C[C@H](CCN1)OCCN(C)C
: