Target
Beta-secretase 2
Ligand
BDBM50372181
Substrate
Meas. Tech.
ChEMBL_464800 (CHEMBL946839)
IC50
54±n/a nM
Citation
 Iserloh, UWu, YCumming, JNPan, JWang, LYStamford, AWKennedy, MEKuvelkar, RChen, XParker, EMStrickland, CVoigt, J Potent pyrrolidine- and piperidine-based BACE-1 inhibitors. Bioorg Med Chem Lett 18:414-7 (2008)  
Target
Name:
Beta-secretase 2
Synonyms:
AEPLC ASP1 Asp 1 Aspartyl protease 1 BACE2_HUMAN Beta-secretase (BACE) Beta-secretase 2 (BACE-2) Beta-site APP-cleaving enzyme 2 Memapsin-1 beta-Secretase (BACE-2)
Type:
Protein
Mol. Mass.:
56171.20
Organism:
Homo sapiens (Human)
Description:
Q9Y5Z0
Residue:
518
  
Inhibitor
Name:
BDBM50372181
Synonyms:
CHEMBL403727
Type:
Small organic molecule
Emp. Form.:
C34H41F2N3O4
Mol. Mass.:
593.7038
SMILES:
CCCN(CCC)C(=O)c1cc(C)cc(c1)C(=O)N[C@@H](Cc1cc(F)cc(F)c1)[C@H](O)[C@H]1C[C@H](CN1)Oc1ccccc1
: