Target
Nitric oxide synthase, brain
Ligand
BDBM50063300
Substrate
Meas. Tech.
ChEMBL_464820 (CHEMBL946890)
IC50
6000±n/a nM
Citation
 Le Bourdonnec, BLeister, LKAjello, CACassel, JASeida, PRO'Hare, HGu, MChu, GHTuthill, PADeHaven, RNDolle, RE Discovery of a series of aminopiperidines as novel iNOS inhibitors. Bioorg Med Chem Lett 18:336-43 (2008)  
Target
Name:
Nitric oxide synthase, brain
Synonyms:
Constitutive NOS NC-NOS NOS type I nNOS NOS1_HUMAN Neuronal nitric oxide synthase Nitric oxide synthase, neuronal (nNOS) bNOS | nNOS
Type:
Homodimer
Mol. Mass.:
160985.98
Organism:
Homo sapiens (Human)
Description:
P29475
Residue:
1434
  
Inhibitor
Name:
BDBM50063300
Synonyms:
(L-N6-1-iminoethyl)lysine 6-Acetimidoylamino-2-amino-hexanoic acid CHEMBL7889 N~6~-[(1Z)-ethanimidoyl]-L-lysine | l-NIL
Type:
Small organic molecule
Emp. Form.:
C8H17N3O2
Mol. Mass.:
187.2395
SMILES:
CC(N)=NCCCC[C@H](N)C(O)=O
: