Target
Beta-secretase 1
Ligand
BDBM16753
Substrate
Meas. Tech.
ChEMBL_464832 (CHEMBL930550)
IC50
700±n/a nM
Citation
 Jennings, LDCole, DCStock, JRSukhdeo, MNEllingboe, JWCowling, RJin, GManas, ESFan, KYMalamas, MSHarrison, BLJacobsen, SChopra, RLohse, PAMoore, WJO'Donnell, MMHu, YRobichaud, AJTurner, MJWagner, EBard, J Acylguanidine inhibitors of beta-secretase: optimization of the pyrrole ring substituents extending into the S1' substrate binding pocket. Bioorg Med Chem Lett 18:767-71 (2008)  
Target
Name:
Beta-secretase 1
Synonyms:
ASP2 Aspartyl protease 2 BACE1 Beta-secretase (BACE) Beta-secretase 1 (BACE 1) Beta-secretase 1 (BACE1) Beta-site amyloid precursor protein cleaving enzyme 1 Memapsin-2 beta-Secretase (BACE-1) | beta-Secretase (BACE1)
Type:
Protein
Mol. Mass.:
55755.10
Organism:
Homo sapiens (Human)
Description:
P56817
Residue:
501
  
Inhibitor
Name:
BDBM16753
Synonyms:
2-[2-(2-chlorophenyl)-5-[4-(4-acetylphenoxy)phenyl]-1H-pyrrol-1-yl]-N-(diaminomethylidene)acetamide CHEMBL253237 | N-{2-[2-[4-(4-Acetyl-phenoxy)-phenyl]-5-(2-chloro-phenyl)-pyrrol-1-yl]-acetyl}-guanidine
Type:
Small organic molecule
Emp. Form.:
C27H23ClN4O3
Mol. Mass.:
486.95
SMILES:
CC(=O)c1ccc(Oc2ccc(cc2)-c2ccc(-c3ccccc3Cl)n2CC(=O)NC(N)=N)cc1
: