Target
Integrin alpha-V/beta-5
Ligand
BDBM50235980
Substrate
Meas. Tech.
ChEMBL_465289 (CHEMBL933854)
IC50
0.13±n/a nM
Citation
 Zanardi, FBurreddu, PRassu, GAuzzas, LBattistini, LCurti, CSartori, ANicastro, GMenchi, GCini, NBottoncetti, ABottonocetti, ARaspanti, SCasiraghi, G Discovery of subnanomolar arginine-glycine-aspartate-based alphaVbeta3/alphaVbeta5 integrin binders embedding 4-aminoproline residues. J Med Chem 51:1771-82 (2008)  
Target
Name:
Integrin alpha-V/beta-5
Synonyms:
ITGAV/ITGB5 | Integrin beta-5/Vitronectin receptor alpha
Type:
Enzyme
Mol. Mass.:
Description:
Components:
This complex has 2 components.
Component 1
Name:
Integrin alpha-V
Synonyms:
ITAV_HUMAN Integrin alpha-V/alpha-5 VNRA Vitronectin receptor | Vitronectin receptor subunit alpha
Type:
PROTEIN
Mol. Mass.:
116024.92
Organism:
Homo sapiens (Human)
Description:
ChEMBL_582336
Residue:
1048
  
Component 2
Name:
Integrin beta-5
Synonyms:
ITB5_HUMAN | ITGB5
Type:
PROTEIN
Mol. Mass.:
88047.37
Organism:
Homo sapiens (Human)
Description:
EBI_10915
Residue:
799
  
Inhibitor
Name:
BDBM50235980
Synonyms:
2-((2S,5R,8S,11S)-5-benzyl-11-(3-guanidinopropyl)-8-isopropyl-7-methyl-3,6,9,12,15-pentaoxo-1,4,7,10,13-pentaazacyclopentadecan-2-yl)acetic acid CILENGITIDE EMD-121974 c(RGDfMeV) | cyclo(Arg-Gly-Asp-D-Phe-[N-Me]Val)
Type:
Small organic molecule
Emp. Form.:
C27H40N8O7
Mol. Mass.:
588.6559
SMILES:
[#6]-[#6](-[#6])-[#6@@H]-1-[#7](-[#6])-[#6](=O)-[#6@@H](-[#6]-c2ccccc2)-[#7]-[#6](=O)-[#6@H](-[#6]-[#6](-[#8])=O)-[#7]-[#6](=O)-[#6]-[#7]-[#6](=O)-[#6@H](-[#6]-[#6]-[#6]\[#7]=[#6](\[#7])-[#7])-[#7]-[#6]-1=O
: