Target
Adenosine receptor A3
Ligand
BDBM50372718
Substrate
Meas. Tech.
ChEMBL_465778 (CHEMBL931047)
Ki
117±n/a nM
Citation
 Jeong, LSLee, HWKim, HOTosh, DKPal, SChoi, WJGao, ZGPatel, ARWilliams, WJacobson, KAKim, HD Structure-activity relationships of 2-chloro-N6-substituted-4'-thioadenosine-5'-N,N-dialkyluronamides as human A3 adenosine receptor antagonists. Bioorg Med Chem Lett 18:1612-6 (2008)  
Target
Name:
Adenosine receptor A3
Synonyms:
A3 adenosine receptor (hA3) ADORA3 | Adenosine A3 receptor (A3AR)
Type:
G Protein-Coupled Receptor (GPCR)
Mol. Mass.:
36197.32
Organism:
Homo sapiens (Human)
Description:
P0DMS8
Residue:
318
  
Inhibitor
Name:
BDBM50372718
Synonyms:
CHEMBL404235
Type:
Small organic molecule
Emp. Form.:
C21H22ClIN6O3S
Mol. Mass.:
600.86
SMILES:
O[C@H]1[C@@H](O)[C@@H](S[C@@H]1C(=O)N1CCCC1)n1cnc2c(NCc3cccc(I)c3)nc(Cl)nc12
: