Target
Adenosine receptor A3
Ligand
BDBM50372723
Substrate
Meas. Tech.
ChEMBL_465778 (CHEMBL931047)
Ki
837±n/a nM
Citation
 Jeong, LSLee, HWKim, HOTosh, DKPal, SChoi, WJGao, ZGPatel, ARWilliams, WJacobson, KAKim, HD Structure-activity relationships of 2-chloro-N6-substituted-4'-thioadenosine-5'-N,N-dialkyluronamides as human A3 adenosine receptor antagonists. Bioorg Med Chem Lett 18:1612-6 (2008)  
Target
Name:
Adenosine receptor A3
Synonyms:
A3 adenosine receptor (hA3) ADORA3 | Adenosine A3 receptor (A3AR)
Type:
G Protein-Coupled Receptor (GPCR)
Mol. Mass.:
36197.32
Organism:
Homo sapiens (Human)
Description:
P0DMS8
Residue:
318
  
Inhibitor
Name:
BDBM50372723
Synonyms:
CHEMBL255597
Type:
Small organic molecule
Emp. Form.:
C17H23ClN6O3S
Mol. Mass.:
426.921
SMILES:
CN(C)C(=O)[C@H]1S[C@H]([C@H](O)[C@@H]1O)n1cnc2c(NC3CCCC3)nc(Cl)nc12
: