Target
ATP-dependent translocase ABCB1
Ligand
BDBM50234488
Substrate
Meas. Tech.
ChEMBL_465975 (CHEMBL931159)
EC50
180±n/a nM
Citation
 Colabufo, NABerardi, FPerrone, RRapposelli, SDigiacomo, MVanni, MBalsamo, A Synthesis and biological evaluation of (hetero)arylmethyloxy- and arylmethylamine-phenyl derivatives as potent P-glycoprotein modulating agents. J Med Chem 51:1415-22 (2008)  
Target
Name:
ATP-dependent translocase ABCB1
Synonyms:
ABCB1 MDR1_HUMAN Multidrug resistance protein 1 P-glycoprotein (P-gp) PGY1
Type:
Protein
Mol. Mass.:
141503.50
Organism:
Homo sapiens (Human)
Description:
P08183
Residue:
1280
  
Inhibitor
Name:
BDBM50234488
Synonyms:
CHEMBL272036 N-[(3,4-dimethoxy)benzyl]-2-[2-(3-methoxyphenyl)ethyl]aniline
Type:
Small organic molecule
Emp. Form.:
C24H27NO3
Mol. Mass.:
377.4761
SMILES:
COc1cccc(CCc2ccccc2NCc2ccc(OC)c(OC)c2)c1
: