Target
Beta-secretase 1
Ligand
BDBM50372982
Substrate
Meas. Tech.
ChEMBL_466180 (CHEMBL947944)
Kd
350000±n/a nM
Citation
 Kuglstatter, AStahl, MPeters, JUHuber, WStihle, MSchlatter, DBenz, JRuf, ARoth, DEnderle, THennig, M Tyramine fragment binding to BACE-1. Bioorg Med Chem Lett 18:1304-7 (2008)  
Target
Name:
Beta-secretase 1
Synonyms:
ASP2 Aspartyl protease 2 BACE1 Beta-secretase (BACE) Beta-secretase 1 (BACE 1) Beta-secretase 1 (BACE1) Beta-site amyloid precursor protein cleaving enzyme 1 Memapsin-2 beta-Secretase (BACE-1) | beta-Secretase (BACE1)
Type:
Protein
Mol. Mass.:
55755.10
Organism:
Homo sapiens (Human)
Description:
P56817
Residue:
501
  
Inhibitor
Name:
BDBM50372982
Synonyms:
CHEMBL272576
Type:
Small organic molecule
Emp. Form.:
C14H15NO
Mol. Mass.:
213.275
SMILES:
NCCc1ccc(O)c(c1)-c1ccccc1
: