Target
C-X-C chemokine receptor type 2
Ligand
BDBM50212239
Substrate
Meas. Tech.
ChEMBL_466548 (CHEMBL935640)
IC50
>10000±n/a nM
Citation
 Jarvis, MFHonore, PShieh, CCChapman, MJoshi, SZhang, XFKort, MCarroll, WMarron, BAtkinson, RThomas, JLiu, DKrambis, MLiu, YMcGaraughty, SChu, KRoeloffs, RZhong, CMikusa, JPHernandez, GGauvin, DWade, CZhu, CPai, MScanio, MShi, LDrizin, IGregg, RMatulenko, MHakeem, AGross, MJohnson, MMarsh, KWagoner, PKSullivan, JPFaltynek, CRKrafte, DS A-803467, a potent and selective Nav1.8 sodium channel blocker, attenuates neuropathic and inflammatory pain in the rat. Proc Natl Acad Sci U S A 104:8520-5 (2007)  
Target
Name:
C-X-C chemokine receptor type 2
Synonyms:
C-X-C chemokine receptor type 2 (CXCR-2) CD_antigen=CD182 CXCR-2 CXCR2_HUMAN GRO/MGSA receptor IL-8 receptor type 2 IL8RB | Interleukin-8 receptor B
Type:
Protein
Mol. Mass.:
40767.88
Organism:
Homo sapiens (Human)
Description:
P25025
Residue:
360
  
Inhibitor
Name:
BDBM50212239
Synonyms:
5-(4-chlorophenyl)-N-(3,5-dimethoxyphenyl)furan-2-carboxamide CHEMBL250699
Type:
Small organic molecule
Emp. Form.:
C19H16ClNO4
Mol. Mass.:
357.788
SMILES:
COc1cc(NC(=O)c2ccc(o2)-c2ccc(Cl)cc2)cc(OC)c1
: