Target
Acetylcholinesterase
Ligand
BDBM31904
Substrate
Meas. Tech.
ChEMBL_466877 (CHEMBL922717)
IC50
12800±n/a nM
Citation
 Xie, QWang, HXia, ZLu, MZhang, WWang, XFu, WTang, YSheng, WLi, WZhou, WZhu, XQiu, ZChen, H Bis-(-)-nor-meptazinols as novel nanomolar cholinesterase inhibitors with high inhibitory potency on amyloid-beta aggregation. J Med Chem 51:2027-36 (2008)  
Target
Name:
Acetylcholinesterase
Synonyms:
ACES_HUMAN Acetylcholinesterase (AChE) | Acetylcholinesterase (human AChE)
Type:
Enzyme
Mol. Mass.:
67792.70
Organism:
Homo sapiens (Human)
Description:
P22303
Residue:
614
  
Inhibitor
Name:
BDBM31904
Synonyms:
CHEMBL345124 Propidium Iodide, 2 | propidium iodide
Type:
Small organic molecule
Emp. Form.:
C27H34N4
Mol. Mass.:
414.5846
SMILES:
CC[N+](C)(CC)CCCn1c(-c2ccccc2)c2cc(N)ccc2c2ccc(=[NH2+])cc12
: