Target
Acetylcholinesterase
Ligand
BDBM50373118
Substrate
Meas. Tech.
ChEMBL_466872 (CHEMBL922712)
IC50
24±n/a nM
Citation
 Xie, QWang, HXia, ZLu, MZhang, WWang, XFu, WTang, YSheng, WLi, WZhou, WZhu, XQiu, ZChen, H Bis-(-)-nor-meptazinols as novel nanomolar cholinesterase inhibitors with high inhibitory potency on amyloid-beta aggregation. J Med Chem 51:2027-36 (2008)  
Target
Name:
Acetylcholinesterase
Synonyms:
ACES_MOUSE Acetylcholinesterase (mouse AChE) Ache
Type:
Enzyme
Mol. Mass.:
68165.65
Organism:
Mus musculus (mouse)
Description:
Residue:
614
  
Inhibitor
Name:
BDBM50373118
Synonyms:
CHEMBL406885
Type:
Small organic molecule
Emp. Form.:
C39H62N2O2
Mol. Mass.:
590.9218
SMILES:
CC[C@]1(CCCCN(CCCCCCCCCCCN2CCCC[C@](CC)(C2)c2cccc(O)c2)C1)c1cccc(O)c1
: