Target
Glutamate receptor ionotropic, kainate 2
Ligand
BDBM17657
Substrate
Meas. Tech.
ChEMBL_467211 (CHEMBL928082)
EC50
66000±n/a nM
Citation
 Pinto, AConti, PDe Amici, MTamborini, LMadsen, UNielsen, BChristesen, TBräuner-Osborne, HDe Micheli, C Synthesis and pharmacological characterization at glutamate receptors of the four enantiopure isomers of tricholomic acid. J Med Chem 51:2311-5 (2008)  
Target
Name:
Glutamate receptor ionotropic, kainate 2
Synonyms:
GRIK2_RAT Glutamate receptor ionotropic kainate 2 Ionotropic glutamate receptor kainate 2/5
Type:
PROTEIN
Mol. Mass.:
102478.61
Organism:
Rattus norvegicus
Description:
ChEMBL_936439
Residue:
908
  
Inhibitor
Name:
BDBM17657
Synonyms:
(2S)-2-aminopentanedioic acid D-Glutamate L-Glu L-Glutamic acid L-gluatmate
Type:
Amino Acid
Emp. Form.:
C5H9NO4
Mol. Mass.:
147.1293
SMILES:
N[C@@H](CCC(O)=O)C(O)=O
: